build system development

It’s not perfect yet – there should be listings I think for test and benchmark failures – but you can see it’s getting there! the output isn’t very ordered yet, either. I also have a ton of benchmark gunplots, which were automatically generated 🙂

Total time about 420 minutes on the slowest platform, so about seven hours (platforms run in parallel).

The “512 FAILED” is a bit of a bug – it should say failed, but the number seems unexpected =-)

localhost : x86_64 : gcc : 5.3.0 : ar_vanilla : build : 0
localhost : x86_64 : gcc : 5.3.0 : so_dbg : build : 0
localhost : x86_64 : gcc : 5.3.0 : so_rel : build : 0
localhost : x86_64 : gcc : 5.3.0 : ar_prof : build : 0
localhost : x86_64 : gcc : 5.3.0 : ar_cov : build : 0
localhost : x86_64 : gcc : 5.3.0 : ar_dbg : build : 0
localhost : x86_64 : gcc : 5.3.0 : so_prof : build : 0
localhost : x86_64 : gcc : 5.3.0 : so_vanilla : build : 0
localhost : x86_64 : gcc : 5.3.0 : so_tsan : build : 0
localhost : x86_64 : gcc : 5.3.0 : ar_rel : build : 0
localhost : x86_64 : gcc : 5.3.0 : ar_tsan : build : 0
localhost : x86_64 : gcc : 5.1.0 : ar_vanilla : build : 0
localhost : x86_64 : gcc : 5.1.0 : so_dbg : build : 0
localhost : x86_64 : gcc : 5.1.0 : so_rel : build : 0
localhost : x86_64 : gcc : 5.1.0 : ar_prof : build : 0
localhost : x86_64 : gcc : 5.1.0 : ar_cov : build : 0
localhost : x86_64 : gcc : 5.1.0 : ar_dbg : build : 0
localhost : x86_64 : gcc : 5.1.0 : so_prof : build : 0
localhost : x86_64 : gcc : 5.1.0 : so_vanilla : build : 0
localhost : x86_64 : gcc : 5.1.0 : so_tsan : build : 0
localhost : x86_64 : gcc : 5.1.0 : ar_rel : build : 0
localhost : x86_64 : gcc : 5.1.0 : ar_tsan : build : 0
localhost : x86_64 : gcc : 6.2.0 : ar_vanilla : build : 0
localhost : x86_64 : gcc : 6.2.0 : so_dbg : build : 0
localhost : x86_64 : gcc : 6.2.0 : so_rel : build : 0
localhost : x86_64 : gcc : 6.2.0 : ar_prof : build : 0
localhost : x86_64 : gcc : 6.2.0 : ar_cov : build : 0
localhost : x86_64 : gcc : 6.2.0 : ar_dbg : build : 0
localhost : x86_64 : gcc : 6.2.0 : so_prof : build : 0
localhost : x86_64 : gcc : 6.2.0 : so_vanilla : build : 0
localhost : x86_64 : gcc : 6.2.0 : so_tsan : build : 0
localhost : x86_64 : gcc : 6.2.0 : ar_rel : build : 0
localhost : x86_64 : gcc : 6.2.0 : ar_tsan : build : 0
localhost : x86_64 : gcc : 4.6.4 : ar_vanilla : build : 512 FAILED
localhost : x86_64 : gcc : 4.6.4 : so_dbg : build : 512 FAILED
localhost : x86_64 : gcc : 4.6.4 : so_rel : build : 512 FAILED
localhost : x86_64 : gcc : 4.6.4 : ar_prof : build : 512 FAILED
localhost : x86_64 : gcc : 4.6.4 : ar_cov : build : 512 FAILED
localhost : x86_64 : gcc : 4.6.4 : ar_dbg : build : 512 FAILED
localhost : x86_64 : gcc : 4.6.4 : so_prof : build : 512 FAILED
localhost : x86_64 : gcc : 4.6.4 : so_vanilla : build : 512 FAILED
localhost : x86_64 : gcc : 4.6.4 : ar_rel : build : 512 FAILED
localhost : x86_64 : gcc : 7.1.0 : ar_vanilla : build : 0
localhost : x86_64 : gcc : 7.1.0 : so_dbg : build : 0
localhost : x86_64 : gcc : 7.1.0 : so_rel : build : 0
localhost : x86_64 : gcc : 7.1.0 : ar_prof : build : 0
localhost : x86_64 : gcc : 7.1.0 : ar_cov : build : 0
localhost : x86_64 : gcc : 7.1.0 : ar_dbg : build : 0
localhost : x86_64 : gcc : 7.1.0 : so_prof : build : 0
localhost : x86_64 : gcc : 7.1.0 : so_vanilla : build : 0
localhost : x86_64 : gcc : 7.1.0 : so_tsan : build : 0
localhost : x86_64 : gcc : 7.1.0 : ar_rel : build : 0
localhost : x86_64 : gcc : 7.1.0 : ar_tsan : build : 0
localhost : x86_64 : gcc : 6.3.0 : ar_vanilla : build : 0
localhost : x86_64 : gcc : 6.3.0 : so_dbg : build : 0
localhost : x86_64 : gcc : 6.3.0 : so_rel : build : 0
localhost : x86_64 : gcc : 6.3.0 : ar_prof : build : 0
localhost : x86_64 : gcc : 6.3.0 : ar_cov : build : 0
localhost : x86_64 : gcc : 6.3.0 : ar_dbg : build : 0
localhost : x86_64 : gcc : 6.3.0 : so_prof : build : 0
localhost : x86_64 : gcc : 6.3.0 : so_vanilla : build : 0
localhost : x86_64 : gcc : 6.3.0 : so_tsan : build : 0
localhost : x86_64 : gcc : 6.3.0 : ar_rel : build : 0
localhost : x86_64 : gcc : 6.3.0 : ar_tsan : build : 0
localhost : x86_64 : gcc : 4.8.0 : ar_vanilla : build : 0
localhost : x86_64 : gcc : 4.8.0 : so_dbg : build : 0
localhost : x86_64 : gcc : 4.8.0 : so_rel : build : 0
localhost : x86_64 : gcc : 4.8.0 : ar_prof : build : 0
localhost : x86_64 : gcc : 4.8.0 : ar_cov : build : 0
localhost : x86_64 : gcc : 4.8.0 : ar_dbg : build : 0
localhost : x86_64 : gcc : 4.8.0 : so_prof : build : 0
localhost : x86_64 : gcc : 4.8.0 : so_vanilla : build : 0
localhost : x86_64 : gcc : 4.8.0 : so_tsan : build : 0
localhost : x86_64 : gcc : 4.8.0 : ar_rel : build : 0
localhost : x86_64 : gcc : 4.8.0 : ar_tsan : build : 0
localhost : x86_64 : gcc : 6.1.0 : ar_vanilla : build : 0
localhost : x86_64 : gcc : 6.1.0 : so_dbg : build : 0
localhost : x86_64 : gcc : 6.1.0 : so_rel : build : 0
localhost : x86_64 : gcc : 6.1.0 : ar_prof : build : 0
localhost : x86_64 : gcc : 6.1.0 : ar_cov : build : 0
localhost : x86_64 : gcc : 6.1.0 : ar_dbg : build : 0
localhost : x86_64 : gcc : 6.1.0 : so_prof : build : 0
localhost : x86_64 : gcc : 6.1.0 : so_vanilla : build : 0
localhost : x86_64 : gcc : 6.1.0 : so_tsan : build : 0
localhost : x86_64 : gcc : 6.1.0 : ar_rel : build : 0
localhost : x86_64 : gcc : 6.1.0 : ar_tsan : build : 0
localhost : x86_64 : gcc : 4.9.4 : ar_vanilla : build : 0
localhost : x86_64 : gcc : 4.9.4 : so_dbg : build : 0
localhost : x86_64 : gcc : 4.9.4 : so_rel : build : 0
localhost : x86_64 : gcc : 4.9.4 : ar_prof : build : 0
localhost : x86_64 : gcc : 4.9.4 : ar_cov : build : 0
localhost : x86_64 : gcc : 4.9.4 : ar_dbg : build : 0
localhost : x86_64 : gcc : 4.9.4 : so_prof : build : 0
localhost : x86_64 : gcc : 4.9.4 : so_vanilla : build : 0
localhost : x86_64 : gcc : 4.9.4 : so_tsan : build : 0
localhost : x86_64 : gcc : 4.9.4 : ar_rel : build : 0
localhost : x86_64 : gcc : 4.9.4 : ar_tsan : build : 0
localhost : x86_64 : gcc : 4.8.5 : ar_vanilla : build : 0
localhost : x86_64 : gcc : 4.8.5 : so_dbg : build : 0
localhost : x86_64 : gcc : 4.8.5 : so_rel : build : 0
localhost : x86_64 : gcc : 4.8.5 : ar_prof : build : 0
localhost : x86_64 : gcc : 4.8.5 : ar_cov : build : 0
localhost : x86_64 : gcc : 4.8.5 : ar_dbg : build : 0
localhost : x86_64 : gcc : 4.8.5 : so_prof : build : 0
localhost : x86_64 : gcc : 4.8.5 : so_vanilla : build : 0
localhost : x86_64 : gcc : 4.8.5 : so_tsan : build : 0
localhost : x86_64 : gcc : 4.8.5 : ar_rel : build : 0
localhost : x86_64 : gcc : 4.8.5 : ar_tsan : build : 0
localhost : x86_64 : gcc : 5.4.0 : ar_vanilla : build : 0
localhost : x86_64 : gcc : 5.4.0 : so_dbg : build : 0
localhost : x86_64 : gcc : 5.4.0 : so_rel : build : 0
localhost : x86_64 : gcc : 5.4.0 : ar_prof : build : 0
localhost : x86_64 : gcc : 5.4.0 : ar_cov : build : 0
localhost : x86_64 : gcc : 5.4.0 : ar_dbg : build : 0
localhost : x86_64 : gcc : 5.4.0 : so_prof : build : 0
localhost : x86_64 : gcc : 5.4.0 : so_vanilla : build : 0
localhost : x86_64 : gcc : 5.4.0 : so_tsan : build : 0
localhost : x86_64 : gcc : 5.4.0 : ar_rel : build : 0
localhost : x86_64 : gcc : 5.4.0 : ar_tsan : build : 0
localhost : x86_64 : gcc : 4.5.4 : ar_vanilla : build : 512 FAILED
localhost : x86_64 : gcc : 4.5.4 : so_dbg : build : 512 FAILED
localhost : x86_64 : gcc : 4.5.4 : so_rel : build : 512 FAILED
localhost : x86_64 : gcc : 4.5.4 : ar_prof : build : 512 FAILED
localhost : x86_64 : gcc : 4.5.4 : ar_cov : build : 512 FAILED
localhost : x86_64 : gcc : 4.5.4 : ar_dbg : build : 512 FAILED
localhost : x86_64 : gcc : 4.5.4 : so_prof : build : 512 FAILED
localhost : x86_64 : gcc : 4.5.4 : so_vanilla : build : 512 FAILED
localhost : x86_64 : gcc : 4.5.4 : ar_rel : build : 512 FAILED
raspberrypi : arm : gcc : 5.1.0 : ar_vanilla : build : 512 FAILED
raspberrypi : arm : gcc : 5.1.0 : so_dbg : build : 512 FAILED
raspberrypi : arm : gcc : 5.1.0 : so_rel : build : 512 FAILED
raspberrypi : arm : gcc : 5.1.0 : ar_prof : build : 512 FAILED
raspberrypi : arm : gcc : 5.1.0 : ar_cov : build : 512 FAILED
raspberrypi : arm : gcc : 5.1.0 : ar_dbg : build : 512 FAILED
raspberrypi : arm : gcc : 5.1.0 : so_prof : build : 512 FAILED
raspberrypi : arm : gcc : 5.1.0 : so_vanilla : build : 512 FAILED
raspberrypi : arm : gcc : 5.1.0 : ar_rel : build : 512 FAILED
raspberrypi : arm : gcc : 4.8.5 : ar_vanilla : build : 512 FAILED
raspberrypi : arm : gcc : 4.8.5 : so_dbg : build : 512 FAILED
raspberrypi : arm : gcc : 4.8.5 : so_rel : build : 512 FAILED
raspberrypi : arm : gcc : 4.8.5 : ar_prof : build : 512 FAILED
raspberrypi : arm : gcc : 4.8.5 : ar_cov : build : 512 FAILED
raspberrypi : arm : gcc : 4.8.5 : ar_dbg : build : 512 FAILED
raspberrypi : arm : gcc : 4.8.5 : so_prof : build : 512 FAILED
raspberrypi : arm : gcc : 4.8.5 : so_vanilla : build : 512 FAILED
raspberrypi : arm : gcc : 4.8.5 : ar_rel : build : 512 FAILED
raspberrypi : arm : gcc : 5.4.0 : ar_vanilla : build : 0
raspberrypi : arm : gcc : 5.4.0 : so_dbg : build : 0
raspberrypi : arm : gcc : 5.4.0 : so_rel : build : 0
raspberrypi : arm : gcc : 5.4.0 : ar_prof : build : 0
raspberrypi : arm : gcc : 5.4.0 : ar_cov : build : 0
raspberrypi : arm : gcc : 5.4.0 : ar_dbg : build : 0
raspberrypi : arm : gcc : 5.4.0 : so_prof : build : 0
raspberrypi : arm : gcc : 5.4.0 : so_vanilla : build : 0
raspberrypi : arm : gcc : 5.4.0 : ar_rel : build : 0
raspberrypi : arm : gcc : 4.9.4 : ar_vanilla : build : 512 FAILED
raspberrypi : arm : gcc : 4.9.4 : so_dbg : build : 512 FAILED
raspberrypi : arm : gcc : 4.9.4 : so_rel : build : 512 FAILED
raspberrypi : arm : gcc : 4.9.4 : ar_prof : build : 512 FAILED
raspberrypi : arm : gcc : 4.9.4 : ar_cov : build : 512 FAILED
raspberrypi : arm : gcc : 4.9.4 : ar_dbg : build : 512 FAILED
raspberrypi : arm : gcc : 4.9.4 : so_prof : build : 512 FAILED
raspberrypi : arm : gcc : 4.9.4 : so_vanilla : build : 512 FAILED
raspberrypi : arm : gcc : 4.9.4 : ar_rel : build : 512 FAILED
raspberrypi : arm : gcc : 6.2.0 : ar_vanilla : build : 512 FAILED
raspberrypi : arm : gcc : 6.2.0 : so_dbg : build : 512 FAILED
raspberrypi : arm : gcc : 6.2.0 : so_rel : build : 512 FAILED
raspberrypi : arm : gcc : 6.2.0 : ar_prof : build : 512 FAILED
raspberrypi : arm : gcc : 6.2.0 : ar_cov : build : 512 FAILED
raspberrypi : arm : gcc : 6.2.0 : ar_dbg : build : 512 FAILED
raspberrypi : arm : gcc : 6.2.0 : so_prof : build : 512 FAILED
raspberrypi : arm : gcc : 6.2.0 : so_vanilla : build : 512 FAILED
raspberrypi : arm : gcc : 6.2.0 : ar_rel : build : 512 FAILED
raspberrypi : arm : gcc : 7.1.0 : ar_vanilla : build : 0
raspberrypi : arm : gcc : 7.1.0 : so_dbg : build : 0
raspberrypi : arm : gcc : 7.1.0 : so_rel : build : 0
raspberrypi : arm : gcc : 7.1.0 : ar_prof : build : 0
raspberrypi : arm : gcc : 7.1.0 : ar_cov : build : 0
raspberrypi : arm : gcc : 7.1.0 : ar_dbg : build : 0
raspberrypi : arm : gcc : 7.1.0 : so_prof : build : 0
raspberrypi : arm : gcc : 7.1.0 : so_vanilla : build : 0
raspberrypi : arm : gcc : 7.1.0 : ar_rel : build : 0
raspberrypi : arm : gcc : 4.8.0 : ar_vanilla : build : 512 FAILED
raspberrypi : arm : gcc : 4.8.0 : so_dbg : build : 512 FAILED
raspberrypi : arm : gcc : 4.8.0 : so_rel : build : 512 FAILED
raspberrypi : arm : gcc : 4.8.0 : ar_prof : build : 512 FAILED
raspberrypi : arm : gcc : 4.8.0 : ar_cov : build : 512 FAILED
raspberrypi : arm : gcc : 4.8.0 : ar_dbg : build : 512 FAILED
raspberrypi : arm : gcc : 4.8.0 : so_prof : build : 512 FAILED
raspberrypi : arm : gcc : 4.8.0 : so_vanilla : build : 512 FAILED
raspberrypi : arm : gcc : 4.8.0 : ar_rel : build : 512 FAILED
pine64 : aarch64 : gcc : 5.1.0 : ar_vanilla : build : 0
pine64 : aarch64 : gcc : 5.1.0 : so_dbg : build : 0
pine64 : aarch64 : gcc : 5.1.0 : so_rel : build : 0
pine64 : aarch64 : gcc : 5.1.0 : ar_cov : build : 0
pine64 : aarch64 : gcc : 5.1.0 : ar_dbg : build : 0
pine64 : aarch64 : gcc : 5.1.0 : so_prof : build : 0
pine64 : aarch64 : gcc : 5.1.0 : so_vanilla : build : 0
pine64 : aarch64 : gcc : 5.1.0 : ar_prof : build : 0
pine64 : aarch64 : gcc : 5.1.0 : ar_rel : build : 0
pine64 : aarch64 : gcc : 4.8.5 : ar_vanilla : build : 0
pine64 : aarch64 : gcc : 4.8.5 : so_dbg : build : 0
pine64 : aarch64 : gcc : 4.8.5 : so_rel : build : 0
pine64 : aarch64 : gcc : 4.8.5 : ar_cov : build : 0
pine64 : aarch64 : gcc : 4.8.5 : ar_dbg : build : 0
pine64 : aarch64 : gcc : 4.8.5 : so_vanilla : build : 0
pine64 : aarch64 : gcc : 4.8.5 : ar_rel : build : 0
pine64 : aarch64 : gcc : 5.4.0 : ar_vanilla : build : 0
pine64 : aarch64 : gcc : 5.4.0 : so_dbg : build : 0
pine64 : aarch64 : gcc : 5.4.0 : so_rel : build : 0
pine64 : aarch64 : gcc : 5.4.0 : ar_cov : build : 0
pine64 : aarch64 : gcc : 5.4.0 : ar_dbg : build : 0
pine64 : aarch64 : gcc : 5.4.0 : so_prof : build : 0
pine64 : aarch64 : gcc : 5.4.0 : so_vanilla : build : 0
pine64 : aarch64 : gcc : 5.4.0 : ar_prof : build : 0
pine64 : aarch64 : gcc : 5.4.0 : ar_rel : build : 0
pine64 : aarch64 : gcc : 4.9.1 : ar_vanilla : build : 0
pine64 : aarch64 : gcc : 4.9.1 : so_dbg : build : 0
pine64 : aarch64 : gcc : 4.9.1 : so_rel : build : 0
pine64 : aarch64 : gcc : 4.9.1 : ar_cov : build : 0
pine64 : aarch64 : gcc : 4.9.1 : ar_dbg : build : 0
pine64 : aarch64 : gcc : 4.9.1 : so_prof : build : 0
pine64 : aarch64 : gcc : 4.9.1 : so_vanilla : build : 0
pine64 : aarch64 : gcc : 4.9.1 : ar_prof : build : 0
pine64 : aarch64 : gcc : 4.9.1 : ar_rel : build : 0
pine64 : aarch64 : gcc : 4.9.0 : ar_vanilla : build : 0
pine64 : aarch64 : gcc : 4.9.0 : so_dbg : build : 0
pine64 : aarch64 : gcc : 4.9.0 : so_rel : build : 0
pine64 : aarch64 : gcc : 4.9.0 : ar_cov : build : 0
pine64 : aarch64 : gcc : 4.9.0 : ar_dbg : build : 0
pine64 : aarch64 : gcc : 4.9.0 : so_prof : build : 0
pine64 : aarch64 : gcc : 4.9.0 : so_vanilla : build : 0
pine64 : aarch64 : gcc : 4.9.0 : ar_prof : build : 0
pine64 : aarch64 : gcc : 4.9.0 : ar_rel : build : 0
pine64 : aarch64 : gcc : 7.1.0 : ar_vanilla : build : 0
pine64 : aarch64 : gcc : 7.1.0 : so_dbg : build : 0
pine64 : aarch64 : gcc : 7.1.0 : so_rel : build : 0
pine64 : aarch64 : gcc : 7.1.0 : ar_cov : build : 0
pine64 : aarch64 : gcc : 7.1.0 : ar_dbg : build : 0
pine64 : aarch64 : gcc : 7.1.0 : so_prof : build : 0
pine64 : aarch64 : gcc : 7.1.0 : ar_prof : build : 0
pine64 : aarch64 : gcc : 7.1.0 : so_vanilla : build : 0
pine64 : aarch64 : gcc : 7.1.0 : so_tsan : build : 0
pine64 : aarch64 : gcc : 7.1.0 : ar_rel : build : 0
pine64 : aarch64 : gcc : 7.1.0 : ar_tsan : build : 0
pine64 : aarch64 : gcc : 6.1.0 : ar_vanilla : build : 0
pine64 : aarch64 : gcc : 6.1.0 : so_dbg : build : 0
pine64 : aarch64 : gcc : 6.1.0 : so_rel : build : 0
pine64 : aarch64 : gcc : 6.1.0 : ar_cov : build : 0
pine64 : aarch64 : gcc : 6.1.0 : ar_dbg : build : 0
pine64 : aarch64 : gcc : 6.1.0 : so_prof : build : 0
pine64 : aarch64 : gcc : 6.1.0 : ar_prof : build : 0
pine64 : aarch64 : gcc : 6.1.0 : so_vanilla : build : 0
pine64 : aarch64 : gcc : 6.1.0 : so_tsan : build : 0
pine64 : aarch64 : gcc : 6.1.0 : ar_rel : build : 0
pine64 : aarch64 : gcc : 6.1.0 : ar_tsan : build : 0
pine64 : aarch64 : gcc : 6.3.0 : ar_vanilla : build : 0
pine64 : aarch64 : gcc : 6.3.0 : so_dbg : build : 0
pine64 : aarch64 : gcc : 6.3.0 : so_rel : build : 0
pine64 : aarch64 : gcc : 6.3.0 : ar_cov : build : 0
pine64 : aarch64 : gcc : 6.3.0 : ar_dbg : build : 0
pine64 : aarch64 : gcc : 6.3.0 : so_prof : build : 0
pine64 : aarch64 : gcc : 6.3.0 : ar_prof : build : 0
pine64 : aarch64 : gcc : 6.3.0 : so_vanilla : build : 0
pine64 : aarch64 : gcc : 6.3.0 : so_tsan : build : 0
pine64 : aarch64 : gcc : 6.3.0 : ar_rel : build : 0
pine64 : aarch64 : gcc : 6.3.0 : ar_tsan : build : 0
pine64 : aarch64 : gcc : 4.9.4 : ar_vanilla : build : 0
pine64 : aarch64 : gcc : 4.9.4 : so_dbg : build : 0
pine64 : aarch64 : gcc : 4.9.4 : so_rel : build : 0
pine64 : aarch64 : gcc : 4.9.4 : ar_cov : build : 0
pine64 : aarch64 : gcc : 4.9.4 : ar_dbg : build : 0
pine64 : aarch64 : gcc : 4.9.4 : so_prof : build : 0
pine64 : aarch64 : gcc : 4.9.4 : so_vanilla : build : 0
pine64 : aarch64 : gcc : 4.9.4 : ar_prof : build : 0
pine64 : aarch64 : gcc : 4.9.4 : ar_rel : build : 0
pine64 : aarch64 : gcc : 4.8.0 : ar_vanilla : build : 0
pine64 : aarch64 : gcc : 4.8.0 : so_dbg : build : 0
pine64 : aarch64 : gcc : 4.8.0 : so_rel : build : 0
pine64 : aarch64 : gcc : 4.8.0 : ar_cov : build : 0
pine64 : aarch64 : gcc : 4.8.0 : ar_dbg : build : 0
pine64 : aarch64 : gcc : 4.8.0 : so_vanilla : build : 0
pine64 : aarch64 : gcc : 4.8.0 : ar_rel : build : 0
minnow : i686 : gcc : 5.1.0 : ar_vanilla : build : 0
minnow : i686 : gcc : 5.1.0 : so_dbg : build : 0
minnow : i686 : gcc : 5.1.0 : so_rel : build : 0
minnow : i686 : gcc : 5.1.0 : ar_prof : build : 0
minnow : i686 : gcc : 5.1.0 : ar_cov : build : 0
minnow : i686 : gcc : 5.1.0 : ar_dbg : build : 0
minnow : i686 : gcc : 5.1.0 : so_prof : build : 0
minnow : i686 : gcc : 5.1.0 : so_vanilla : build : 0
minnow : i686 : gcc : 5.1.0 : ar_rel : build : 0
minnow : i686 : gcc : 4.8.5 : ar_vanilla : build : 0
minnow : i686 : gcc : 4.8.5 : so_dbg : build : 0
minnow : i686 : gcc : 4.8.5 : so_rel : build : 0
minnow : i686 : gcc : 4.8.5 : ar_prof : build : 0
minnow : i686 : gcc : 4.8.5 : ar_cov : build : 0
minnow : i686 : gcc : 4.8.5 : ar_dbg : build : 0
minnow : i686 : gcc : 4.8.5 : so_prof : build : 0
minnow : i686 : gcc : 4.8.5 : so_vanilla : build : 0
minnow : i686 : gcc : 4.8.5 : ar_rel : build : 0
minnow : i686 : gcc : 5.4.0 : ar_vanilla : build : 0
minnow : i686 : gcc : 5.4.0 : so_dbg : build : 0
minnow : i686 : gcc : 5.4.0 : so_rel : build : 0
minnow : i686 : gcc : 5.4.0 : ar_prof : build : 0
minnow : i686 : gcc : 5.4.0 : ar_cov : build : 0
minnow : i686 : gcc : 5.4.0 : ar_dbg : build : 0
minnow : i686 : gcc : 5.4.0 : so_prof : build : 0
minnow : i686 : gcc : 5.4.0 : so_vanilla : build : 0
minnow : i686 : gcc : 5.4.0 : ar_rel : build : 0
minnow : i686 : gcc : 4.6.4 : ar_vanilla : build : 512 FAILED
minnow : i686 : gcc : 4.6.4 : so_dbg : build : 512 FAILED
minnow : i686 : gcc : 4.6.4 : so_rel : build : 512 FAILED
minnow : i686 : gcc : 4.6.4 : ar_prof : build : 512 FAILED
minnow : i686 : gcc : 4.6.4 : ar_cov : build : 512 FAILED
minnow : i686 : gcc : 4.6.4 : ar_dbg : build : 512 FAILED
minnow : i686 : gcc : 4.6.4 : so_prof : build : 512 FAILED
minnow : i686 : gcc : 4.6.4 : so_vanilla : build : 512 FAILED
minnow : i686 : gcc : 4.6.4 : ar_rel : build : 512 FAILED
minnow : i686 : gcc : 4.5.4 : ar_vanilla : build : 512 FAILED
minnow : i686 : gcc : 4.5.4 : so_dbg : build : 512 FAILED
minnow : i686 : gcc : 4.5.4 : so_rel : build : 512 FAILED
minnow : i686 : gcc : 4.5.4 : ar_prof : build : 512 FAILED
minnow : i686 : gcc : 4.5.4 : ar_cov : build : 512 FAILED
minnow : i686 : gcc : 4.5.4 : ar_dbg : build : 512 FAILED
minnow : i686 : gcc : 4.5.4 : so_prof : build : 512 FAILED
minnow : i686 : gcc : 4.5.4 : so_vanilla : build : 512 FAILED
minnow : i686 : gcc : 4.5.4 : ar_rel : build : 512 FAILED
ci20 : mipsel : gcc : 5.1.0 : ar_vanilla : build : 512 FAILED
ci20 : mipsel : gcc : 5.1.0 : so_dbg : build : 512 FAILED
ci20 : mipsel : gcc : 5.1.0 : so_rel : build : 512 FAILED
ci20 : mipsel : gcc : 5.1.0 : ar_prof : build : 512 FAILED
ci20 : mipsel : gcc : 5.1.0 : ar_cov : build : 512 FAILED
ci20 : mipsel : gcc : 5.1.0 : ar_dbg : build : 512 FAILED
ci20 : mipsel : gcc : 5.1.0 : so_prof : build : 512 FAILED
ci20 : mipsel : gcc : 5.1.0 : so_vanilla : build : 512 FAILED
ci20 : mipsel : gcc : 5.1.0 : ar_rel : build : 512 FAILED
ci20 : mipsel : gcc : 4.8.5 : ar_vanilla : build : 512 FAILED
ci20 : mipsel : gcc : 4.8.5 : so_dbg : build : 512 FAILED
ci20 : mipsel : gcc : 4.8.5 : so_rel : build : 512 FAILED
ci20 : mipsel : gcc : 4.8.5 : ar_prof : build : 512 FAILED
ci20 : mipsel : gcc : 4.8.5 : ar_cov : build : 512 FAILED
ci20 : mipsel : gcc : 4.8.5 : ar_dbg : build : 512 FAILED
ci20 : mipsel : gcc : 4.8.5 : so_prof : build : 512 FAILED
ci20 : mipsel : gcc : 4.8.5 : so_vanilla : build : 512 FAILED
ci20 : mipsel : gcc : 4.8.5 : ar_rel : build : 512 FAILED
ci20 : mipsel : gcc : 4.6.4 : ar_vanilla : build : 0
ci20 : mipsel : gcc : 4.6.4 : so_dbg : build : 0
ci20 : mipsel : gcc : 4.6.4 : so_rel : build : 0
ci20 : mipsel : gcc : 4.6.4 : ar_prof : build : 0
ci20 : mipsel : gcc : 4.6.4 : ar_cov : build : 0
ci20 : mipsel : gcc : 4.6.4 : ar_dbg : build : 0
ci20 : mipsel : gcc : 4.6.4 : so_prof : build : 0
ci20 : mipsel : gcc : 4.6.4 : so_vanilla : build : 0
ci20 : mipsel : gcc : 4.6.4 : ar_rel : build : 0
ci20 : mipsel : gcc : 4.8.0 : ar_vanilla : build : 512 FAILED
ci20 : mipsel : gcc : 4.8.0 : so_dbg : build : 512 FAILED
ci20 : mipsel : gcc : 4.8.0 : so_rel : build : 512 FAILED
ci20 : mipsel : gcc : 4.8.0 : ar_prof : build : 512 FAILED
ci20 : mipsel : gcc : 4.8.0 : ar_cov : build : 512 FAILED
ci20 : mipsel : gcc : 4.8.0 : ar_dbg : build : 512 FAILED
ci20 : mipsel : gcc : 4.8.0 : so_prof : build : 512 FAILED
ci20 : mipsel : gcc : 4.8.0 : so_vanilla : build : 512 FAILED
ci20 : mipsel : gcc : 4.8.0 : ar_rel : build : 512 FAILED
ci20 : mipsel : gcc : 4.5.4 : ar_vanilla : build : 0
ci20 : mipsel : gcc : 4.5.4 : so_dbg : build : 0
ci20 : mipsel : gcc : 4.5.4 : so_rel : build : 0
ci20 : mipsel : gcc : 4.5.4 : ar_prof : build : 0
ci20 : mipsel : gcc : 4.5.4 : ar_cov : build : 0
ci20 : mipsel : gcc : 4.5.4 : ar_dbg : build : 0
ci20 : mipsel : gcc : 4.5.4 : so_prof : build : 0
ci20 : mipsel : gcc : 4.5.4 : so_vanilla : build : 0
ci20 : mipsel : gcc : 4.5.4 : ar_rel : build : 0
localhost : 154.152909 minutes
raspberrypi : 136.283255 minutes
pine64 : 300.401916 minutes
minnow : 201.507361 minutes
ci20 : 423.456168 minutes
total time = 423.466951 minutes
...done